Nevada Court of Appeals
type: Class
subclass of: RF6152bC3Ba7bEB25daEC5de
definition: The Nevada Court of Appeals is a court within the Nevada State Courts system that hears appeals from lower courts and makes decisions on legal disputes.