Motions on Timing
type: Class
alternative label: 时间安排动议
subclass of: R8yPMgoH5NMUuEp5UXPgmZo
subclass of: R9Ii4OzSADsjS0VegX12oQJ
definition: A Motion on Timing is a type of procedural motion in a trial court or bankruptcy case that seeks to modify or extend the time frame for a particular action or event, such as setting a hearing or continuing a case.