Fulah
type: Class
alternative label: 富拉语
subclass of: RDOvAHsvY8TKJ1O1orXPM9o
definition: A language spoken primarily in West Africa, including countries such as Senegal, Gambia, and Guinea, among others.