Paper Mills
type: Class
subclass of: 4zureO9jQbWmAeiFcpbiqw
definition: This industry comprises establishments primarily engaged in manufacturing paper from pulp. These establishments may manufacture or purchase pulp. In addition, the establishments may convert the paper they make. The activity of making paper classifies an establishment into this industry regardless of the output.