Health and Welfare Funds
type: Class
subclass of: 3ocz7MdYSiuoBhWuervqOw
definition: This industry comprises legal entities (i.e., funds, plans, and/or programs) organized to provide medical, surgical, hospital, vacation, training, and other health- and welfare-related employee benefits exclusively for the sponsor's employees or members.