Commercial and Industrial Machinery and Equipment (except Automotive and Electronic) Repair and Maintenance
type: Class
subclass of: 0vVfd7ArQSadF882Nob-Zg
definition: This industry comprises establishments primarily engaged in the repair and maintenance of commercial and industrial machinery and equipment. Establishments in this industry either sharpen/install commercial and industrial machinery blades and saws or provide welding (e.g., automotive, general) repair services; or repair agricultural and other heavy and industrial machinery and equipment (e.g., forklifts and other material handling equipment, machine tools, commercial refrigeration equipment, construction equipment, and mining machinery).