Drilling Oil and Gas Wells
type: Class
subclass of: 2A-BXFaYS4aaPb9hUzIjNA
definition: This U.S. industry comprises establishments primarily engaged in drilling oil and gas wells for others on a contract or fee basis. This industry includes contractors that specialize in spudding in, drilling in, redrilling, and directional drilling.