Media Streaming Distribution Services, Social Networks, and Other Media Networks and Content Providers
type: Class
subclass of: aOOhpecFQIOrkOPFHojdtg
definition: This industry comprises establishments primarily providing media streaming distribution services, operating social network sites, operating media broadcasting and cable television networks, and supplying information, such as news reports, articles, pictures, and features, to the news media. These establishments distribute textual, audio, and/or video content of general or specific interest.
example: Broadcasting networks, radio
example: Broadcasting networks, television
example: Cable broadcasting networks
example: Cable television networks
example: Internet broadcasting
example: Pay-per-view cable programming
example: Satellite radio networks
example: Satellite television networks
example: Social network sites, Internet
example: Stand-alone streaming services
example: Subscription Video on Demand (SVOD) services
example: Syndicates, news
example: Virtual Multichannel Video Programming Distributors (vMVPDs)
example: Web broadcasting
example: Wiki sites, Internet