Port and Harbor Operations
type: Class
subclass of: dsk4Wn6YR1eEb2L35YtTnw
definition: This industry comprises establishments primarily engaged in operating ports, harbors (including docking and pier facilities), or canals.