Support Activities for Agriculture and Forestry Industry
type: Class
subclass of: R92xsHpdHu6BJjtepuRu
definition: Industries in the Support Activities for Agriculture and Forestry subsector provide support services that are an essential part of agricultural and forestry production. These support activities may be performed by the agriculture or forestry producing establishment or conducted independently as an alternative source of inputs required for the production process for a given crop, animal, or forestry industry. Establishments that primarily perform these activities independent of the agriculture or forestry producing establishment are in this subsector.