Materials Recovery Facilities
type: Class
subclass of: qi1wRfJKTXmIsjUfbV0NsA
definition: This industry comprises establishments primarily engaged in (1) operating facilities for separating and sorting recyclable materials from nonhazardous waste streams (i.e., garbage) and/or (2) operating facilities where commingled recyclable materials, such as paper, plastics, used beverage cans, and metals, are sorted into distinct categories.