Other Chemical and Allied Products Merchant Wholesalers
type: Class
subclass of: JdwcDwzcQPWI2kNnVa2e3g
definition: This industry comprises establishments primarily engaged in the merchant wholesale distribution of chemicals and allied products (except agricultural and medicinal chemicals, paints and varnishes, fireworks, and plastics materials and basic forms and shapes).
example: Acids merchant wholesalers
example: Automotive chemicals (except lubricating oils and greases) merchant wholesalers
example: Dyestuffs merchant wholesalers
example: Explosives (except ammunition and fireworks) merchant wholesalers
example: Industrial chemicals merchant wholesalers
example: Industrial salts merchant wholesalers
example: Rosins merchant wholesalers
example: Turpentine merchant wholesalers