All Other Automotive Repair and Maintenance
type: Class
subclass of: 6PhkFjpASI2yP-36CyygEA
definition: This U.S. industry comprises establishments primarily engaged in providing automotive repair and maintenance services (except mechanical and electrical repair and maintenance; body, paint, interior, and glass repair; motor oil change and lubrication; and car washing) for automotive vehicles, such as passenger cars, trucks, and vans, and all trailers.
example: Automotive air-conditioning repair shops
example: Automotive rustproofing and undercoating shops
example: Automotive tire repair (except retreading) shops