Pharmacies and Drug Retailers
type: Class
subclass of: vYTRMz9Rm6bNqKxOdG gw
definition: This industry comprises establishments generally known as pharmacies and drug retailers engaged in retailing prescription or nonprescription drugs and medicines.