Motion Picture Theaters (except Drive-Ins)
type: Class
subclass of: 54YBr4S3QZ-zYg8LuKj9sw
definition: This U.S. industry comprises establishments primarily engaged in operating motion picture theaters (except drive-ins) and/or exhibiting motion pictures or videos at film festivals, and so forth.