Cookie and Cracker Manufacturing
type: Class
subclass of: qDsXOU70Tf6usMKyrcjeUQ
definition: This U.S. industry comprises establishments primarily engaged in manufacturing cookies, crackers, and other products, such as ice cream cones.