General Line Grocery Merchant Wholesalers
type: Class
subclass of: D3YWFRcOTNepmT6a5dzRnQ
definition: This industry comprises establishments primarily engaged in the merchant wholesale distribution of a general line (wide range) of groceries.