Motion Picture and Video Industries
type: Class
subclass of: RBMNTqpAJhnP2NSq9YLP9Pq
definition: This industry group comprises establishments primarily engaged in the production and/or distribution of motion pictures, videos, television programs, or commercials; in the exhibition of motion pictures; or in the provision of postproduction and related services.