Metal Can, Box, and Other Metal Container (Light Gauge) Manufacturing
type: Class
subclass of: 1ARrcFziSA2I61gQlRXSPA
definition: This industry comprises establishments primarily engaged in forming light gauge metal containers.