Spring and Wire Product Manufacturing
type: Class
subclass of: DOF5eLGtSpaHRGsWG7QXJw
definition: This industry comprises establishments primarily engaged in (1) manufacturing steel springs by forming, such as cutting, bending, and heat winding, metal rod or strip stock and/or (2) manufacturing wire springs and fabricated wire products from wire drawn elsewhere (except watch and clock springs).