Other Metal Container Manufacturing
type: Class
subclass of: UmtThKRlSUegdS0VuXOEVg
definition: This U.S. industry comprises establishments primarily engaged in manufacturing metal (light gauge) containers (except cans).
example: Light gauge metal bins manufacturing
example: Light gauge metal drums manufacturing
example: Light gauge metal garbage cans manufacturing
example: Light gauge metal lunch boxes manufacturing
example: Light gauge metal mailboxes manufacturing
example: Light gauge metal tool boxes manufacturing
example: Light gauge metal vats manufacturing
example: Metal air cargo containers manufacturing
example: Metal barrels manufacturing
example: Vacuum bottles and jugs manufacturing