Highway, Street, and Bridge Construction
type: Class
subclass of: JJGh3ImfRBCxSv4HKXG4Uw
definition: This industry comprises establishments primarily engaged in the construction of highways (including elevated), streets, roads, airport runways, public sidewalks, or bridges. The work performed may include new work, reconstruction, rehabilitation, and repairs. Specialty trade contractors are included in this industry if they are engaged in activities primarily related to highway, street, and bridge construction (e.g., installing guardrails on highways).
example: Airport runway construction
example: Causeway construction
example: Culverts, highway, road, and street, construction
example: Elevated highway construction
example: Guardrail construction
example: Highway line painting
example: Painting traffic lanes or parking lot lines
example: Pothole filling, highway, road, street, or bridge
example: Resurfacing, highway, road, street, or bridge
example: Sign erection, highway, road, street, or bridge