Professional, Scientific, and Technical Services Industry
type: Class
subclass of: RBFLYkta0F7DwegW1FnUX52
definition: Industries in the Professional, Scientific, and Technical Services subsector group establishments engaged in processes where human capital is the major input. These establishments make available the knowledge and skills of their employees, often on an assignment basis, where an individual or team is responsible for the delivery of services to the client. The individual industries of this subsector are defined on the basis of the particular expertise and training of the services provider. The distinguishing feature of the Professional, Scientific, and Technical Services subsector is the fact that most of the industries grouped in it have production processes that are almost wholly dependent on worker skills. Thus, the establishments classified in this subsector sell expertise. Much of the expertise requires degrees, though not in every case.