Navigational Services to Shipping
type: Class
subclass of: pJmdT1UfSv2jmIPZV4LHHg
definition: This industry comprises establishments primarily engaged in providing navigational services to shipping. Marine salvage establishments are included in this industry.
example: Docking and undocking marine vessel services
example: Marine vessel traffic reporting services
example: Piloting services, water transportation
example: Tugboat services, harbor operation