Pump and Compressor Manufacturing
type: Class
subclass of: S0aqiIi5Q4WHMwEpiXDtkA
definition: This industry comprises establishments primarily engaged in manufacturing pumps and compressors, such as general purpose air and gas compressors, nonagricultural spraying and dusting equipment, general purpose pumps and pumping equipment (except fluid power pumps and motors), and measuring and dispensing pumps.