All Other Miscellaneous Nonmetallic Mineral Product Manufacturing
type: Class
subclass of: JhRFfbpGQvibW3Os07qUcQ
definition: This U.S. industry comprises establishments primarily engaged in manufacturing nonmetallic mineral products (except pottery, ceramics, and plumbing fixtures; clay building materials and refractories; glass and glass products; cement; ready-mix concrete; concrete products; lime; gypsum products; abrasive products; cut stone and stone products; ground and treated minerals and earth; and mineral wool).
example: Dry mix concrete manufacturing
example: Manmade and engineered proppants (e.g., resin-coated sand, ceramic materials) manufacturing
example: Mica products manufacturing
example: Stucco and stucco products manufacturing
example: Synthetic stones, for gem stones and industrial use, manufacturing