Record Production and Distribution
type: Class
subclass of: fPQmRxu2Q7Sg6 Dz jDu5w
definition: This industry comprises establishments primarily engaged in record production and/or releasing, promoting, and distributing sound recordings to wholesalers, retailers, or directly to the public. These establishments contract with artists, arrange and finance the production of original master recordings, and/or produce master recordings themselves, such as digital music and compact discs. Establishments in this industry hold the copyright to the master recording, or obtain reproduction and distribution rights to master recordings produced by others, and derive most of their revenues from the sales, leasing, licensing, or distribution of master recordings.