Television Broadcasting Stations
type: Class
subclass of: V BEzCxcSF-sXWWJhk2IBg
definition: This industry comprises establishments primarily engaged in broadcasting images together with sound. These establishments operate television broadcasting studios and facilities for the programming and transmission of programs to the public. Programming may originate in their own studio, from an affiliated network, or from external sources.