Veneer, Plywood, and Engineered Wood Product Manufacturing
type: Class
subclass of: mzdEFGAxSlGIr0T3i4lKlw
definition: This industry comprises establishments primarily engaged in one or more of the following: (1) manufacturing veneer and/or plywood; (2) manufacturing engineered wood members; and (3) manufacturing reconstituted wood products. This industry includes manufacturing plywood from veneer made in the same establishment or from veneer made in other establishments, and manufacturing plywood faced with nonwood materials, such as plastics or metal.
example: Fabricated structural wood members manufacturing
example: Laminated structural wood members manufacturing
example: Medium density fiberboard (MDF) manufacturing
example: Oriented strandboard (OSB) manufacturing
example: Particleboard manufacturing
example: Plywood manufacturing
example: Reconstituted wood sheets and boards manufacturing
example: Roof trusses, wood, manufacturing
example: Veneer mills
example: Waferboard manufacturing