Other Urban Transit Systems
type: Class
subclass of: 9 7YhBWwQ6unHGEKzv8nzw
definition: This U.S. industry comprises establishments primarily engaged in operating local and suburban ground passenger transit systems (except mixed mode transit systems, commuter rail systems, and buses and other motor vehicles) over regular routes and on regular schedules within a metropolitan area and its adjacent nonurban areas.
example: Commuter cable car systems (i.e., stand-alone)
example: Commuter tramway systems (i.e., stand-alone)
example: Commuter trolley systems (i.e., stand-alone)
example: Light rail systems (i.e., stand-alone)
example: Monorail transit systems (i.e., stand-alone)
example: Subway systems (i.e., stand-alone)