All Other Home Furnishings Retailers
type: Class
subclass of: P0tXIVeLRGS5CsCCNx WGA
definition: This U.S. industry comprises establishments primarily engaged in retailing new home furnishings (except furniture, floor coverings, and window treatments).
example: Bath shops
example: Chinaware retailers
example: Electric lamp retailers
example: Glassware retailers
example: Housewares retailers
example: Kitchenware retailers
example: Linen retailers
example: Picture frame retailers, custom
example: Wood-burning stove retailers