Lawn and Garden Equipment and Supplies Retailers
type: Class
subclass of: RC9gxTda2u80ExW6y0El4YK
definition: This industry group comprises establishments primarily engaged in retailing new lawn and garden equipment and supplies.