Lessors of Nonfinancial Intangible Assets (except Copyrighted Works)
type: Class
subclass of: Oxj6XjK3Tse9IYAUZag7mA
definition: This industry comprises establishments primarily engaged in assigning rights to assets, such as patents, trademarks, brand names, and/or franchise agreements, for which a royalty payment or licensing fee is paid to the asset holder.