All Other Miscellaneous Food Manufacturing
type: Class
subclass of: xvGcowzRSYaFvQ83iwTl3Q
definition: This U.S. industry comprises establishments primarily engaged in manufacturing food (except animal food; grain and oilseed milling; sugar and confectionery products; preserved fruits, vegetables, and specialties; dairy products; meat products; seafood products; bakeries and tortillas; snack foods; coffee and tea; flavoring syrups and concentrates; seasonings and dressings; and perishable prepared food). Included in this industry are establishments primarily engaged in mixing purchased dried and/or dehydrated ingredients including those mixing purchased dried and/or dehydrated ingredients for soup mixes and bouillon.
example: Baking powder manufacturing
example: Cake frosting, prepared, manufacturing
example: Dessert puddings manufacturing
example: Egg substitutes manufacturing
example: Gelatin dessert preparations manufacturing
example: Honey processing
example: Popcorn (except popped) manufacturing
example: Powdered drink mixes (except chocolate, coffee, tea, or milk based) manufacturing
example: Sweetening syrups (except pure maple) manufacturing
example: Yeast manufacturing