Machine Shops; Turned Product; and Screw, Nut, and Bolt Manufacturing
type: Class
subclass of: Ebi1FLjOSRqXDvrM65TO6A
definition: This industry group comprises establishments primarily engaged in one of the following: (1) operating machine shops primarily engaged in machining metal and plastic parts and parts of other composite materials on a job or order basis; (2) machining precision turned products; or (3) manufacturing metal bolts, nuts, screws, rivets, and other industrial fasteners.