Other Miscellaneous Retailers
type: Class
subclass of: RncNeMNwQvKMaiI19YLhFk
definition: This industry group comprises establishments primarily engaged in retailing miscellaneous specialized lines of merchandise (except motor vehicle and parts dealers; building material and garden equipment and supplies dealers; food and beverage retailers; furniture, home furnishings, electronics, and appliance retailers; general merchandise retailers; health and personal care retailers; gasoline stations and fuel dealers; clothing, clothing accessories, shoe, and jewelry retailers; sporting goods, hobby, and musical instrument retailers; book retailers and news dealers; florists; office supplies, stationery, and gift retailers; and used merchandise retailers).