Gasket, Packing, and Sealing Device Manufacturing
type: Class
subclass of: 8Qo4 vlCTraQTxZhVQMm8Q
definition: This U.S. industry comprises establishments primarily engaged in manufacturing gaskets, packing, and sealing devices of all materials.