Convention and Trade Show Organizers
type: Class
subclass of: WOC71urKTceF9NOx8GRViA
definition: This industry comprises establishments primarily engaged in organizing, promoting, and/or managing events, such as business and trade shows, conventions, conferences, and meetings (whether or not they manage and provide the staff to operate the facilities in which these events take place).