All Other Schools and Instruction
type: Class
subclass of: RC407073436a677F31eA6530
definition: This industry comprises establishments primarily engaged in offering instruction (except academic schools, colleges, and universities; business, computer, and management instruction; technical and trade instruction; and fine arts, sports, recreation, and language instruction).
example: Academic tutoring services
example: Automobile driving schools
example: Exam preparation services
example: Public speaking training
example: Speed reading instruction