Apparel Accessories and Other Apparel Manufacturing
type: Class
subclass of: oHloP5FaSiqcHGKWTi7veQ
definition: This industry comprises establishments primarily engaged in manufacturing apparel and accessories (except apparel knitting mills, cut and sew apparel contractors, and cut and sew apparel manufacturing (except contractors)). Jobbers, who perform entrepreneurial functions involved in apparel accessories manufacture, including buying raw materials, designing and preparing samples, arranging for apparel accessories to be made from their materials, and marketing finished apparel accessories, are included. Examples of products made by these establishments are belts, caps, gloves (except medical, safety, sporting), hats, and neckties.