Poultry and Egg Production
type: Class
subclass of: RBpV7a4XyvWmCSvE8cMGfWK
definition: This industry group comprises establishments primarily engaged in breeding, hatching, and raising poultry for meat or egg production.