Home Furnishing Merchant Wholesalers
type: Class
subclass of: Kp0DSGSZQxyBfDUDbdUJPw
definition: This industry comprises establishments primarily engaged in the merchant wholesale distribution of home furnishings and/or housewares.
example: Carpet merchant wholesalers
example: Chinaware, household-type, merchant wholesalers
example: Curtains merchant wholesalers
example: Draperies merchant wholesalers
example: Floor coverings (except wood flooring) merchant wholesalers
example: Glassware, household-type, merchant wholesalers
example: Household-type cooking utensils merchant wholesalers
example: Lamps (i.e., lighting fixtures) merchant wholesalers
example: Linens (e.g., bath, bed, table) merchant wholesalers
example: Window shades and blinds merchant wholesalers