Support Activities for Crop Production
type: Class
subclass of: D 3RuIS2Q2-YTiQ2Mhwlcw
definition: This industry comprises establishments primarily engaged in providing support activities for growing crops.
example: Aerial crop dusting or spraying (i.e., using specialized or dedicated aircraft)
example: Cotton ginning
example: Cultivating services
example: Farm management services
example: Planting crops
example: Vineyard cultivation services