New Car Dealers
type: Class
subclass of: wKQB -I8S3uBHOG0zyetjw
definition: This industry comprises establishments primarily engaged in retailing new automobiles and light trucks, such as sport utility vehicles, and passenger and cargo vans, or retailing these new vehicles in combination with activities, such as repair services, retailing used cars, and selling replacement parts and accessories.
example: Automobile dealers, new only, or new and used
example: Light utility truck dealers, new only, or new and used