Direct Property and Casualty Insurance Carriers
type: Class
subclass of: NSVpiebJSkGCmi49WrOQrA
definition: This U.S. industry comprises establishments primarily engaged in initially underwriting (i.e., assuming the risk and assigning premiums) insurance policies that protect policyholders against losses that may occur as a result of property damage or liability.
example: Automobile insurance carriers, direct
example: Fidelity insurance carriers, direct
example: Homeowners' insurance carriers, direct
example: Liability insurance carriers, direct
example: Malpractice insurance carriers, direct
example: Mortgage guaranty insurance carriers, direct
example: Surety insurance carriers, direct