Roofing, Siding, and Insulation Material Merchant Wholesalers
type: Class
subclass of: 5ndWL1V1SJG OWiJw4QlWA
definition: This industry comprises establishments primarily engaged in the merchant wholesale distribution of nonwood roofing and nonwood siding and insulation materials.