Other Building Material Dealers
type: Class
subclass of: oLd6BswkTKmNnHBKhv41Lw
definition: This industry comprises establishments (except home centers, paint and wallpaper retailers, and hardware retailers) primarily engaged in retailing specialized lines of new building materials, such as lumber, fencing, glass, doors, plumbing fixtures and supplies, electrical supplies, prefabricated buildings and kits, and kitchen and bath cabinets and countertops to be installed.
example: Electrical supply retailers
example: Fencing dealers
example: Floor covering retailers, hardwood or ceramic tile only
example: Garage door dealers
example: Glass (except automotive) retailers
example: Kitchen cabinet (except custom) retailers
example: Lumber yards, retail
example: Plumbing supply retailers
example: Prefabricated building (except manufactured home) dealers