Office Supplies and Stationery Retailers
type: Class
subclass of: kd19cU5aT5WCgbAK6jFL3g
definition: This industry comprises establishments primarily engaged in one or more of the following: (1) retailing new office supplies, stationery, and school supplies; (2) retailing a combination of new office equipment, furniture, and supplies; and (3) retailing new office equipment, furniture, and supplies in combination with selling new computers.