Shellfish Fishing
type: Class
subclass of: feRSrU7jSMuNLYyfCK3qcg
definition: This U.S. industry comprises establishments primarily engaged in the commercial catching or taking of shellfish (e.g., clams, crabs, lobsters, mussels, oysters, sea urchins, shrimp) from their natural habitat.