Toilet Preparation Manufacturing
type: Class
subclass of: cFq018ieSumNauoAZW Q2A
definition: This industry comprises establishments primarily engaged in preparing, blending, compounding, and packaging toilet preparations, such as perfumes, shaving preparations, hair preparations, face creams, lotions (including sunscreens), and other cosmetic preparations.